Target
Cyclin-dependent kinase 2
Ligand
BDBM50293150
Substrate
Meas. Tech.
ChEMBL_496926 (CHEMBL1002021)
IC50
4±n/a nM
Citation
 Stevens, KLReno, MJAlberti, JBPrice, DJKane-Carson, LSKnick, VBShewchuk, LMHassell, AMVeal, JMDavis, STGriffin, RJPeel, MR Synthesis and evaluation of pyrazolo[1,5-b]pyridazines as selective cyclin dependent kinase inhibitors. Bioorg Med Chem Lett 18:5758-62 (2009)  
Target
Name:
Cyclin-dependent kinase 2
Synonyms:
CDK2 CDK2_HUMAN Cell division protein kinase 2 Protein cereblon/Cyclin-dependent kinase 2 | p33 protein kinase
Type:
Enzyme Subunit
Mol. Mass.:
33938.17
Organism:
Homo sapiens (Human)
Description:
P24941
Residue:
298
  
Inhibitor
Name:
BDBM50293150
Synonyms:
CHEMBL468963 GSK screening, 38 TCMDC-138687
Type:
Small organic molecule
Emp. Form.:
C22H21F3N8
Mol. Mass.:
454.4509
SMILES:
CN1CCN(CC1)c1ccc(Nc2nccc(n2)-c2cnn3ncccc23)cc1C(F)(F)F
: