Target
Cyclin-dependent kinase 2
Ligand
BDBM50293158
Substrate
Meas. Tech.
ChEMBL_496926 (CHEMBL1002021)
IC50
40±n/a nM
Citation
 Stevens, KLReno, MJAlberti, JBPrice, DJKane-Carson, LSKnick, VBShewchuk, LMHassell, AMVeal, JMDavis, STGriffin, RJPeel, MR Synthesis and evaluation of pyrazolo[1,5-b]pyridazines as selective cyclin dependent kinase inhibitors. Bioorg Med Chem Lett 18:5758-62 (2009)  
Target
Name:
Cyclin-dependent kinase 2
Synonyms:
CDK2 CDK2_HUMAN Cell division protein kinase 2 Protein cereblon/Cyclin-dependent kinase 2 | p33 protein kinase
Type:
Enzyme Subunit
Mol. Mass.:
33938.17
Organism:
Homo sapiens (Human)
Description:
P24941
Residue:
298
  
Inhibitor
Name:
BDBM50293158
Synonyms:
CHEMBL495751 | N-(2-(diethylamino)ethyl)-3-(4-(pyrazolo[1,5-b]pyridazin-3-yl)pyrimidin-2-ylamino)benzamide
Type:
Small organic molecule
Emp. Form.:
C23H26N8O
Mol. Mass.:
430.5055
SMILES:
CCN(CC)CCNC(=O)c1cccc(Nc2nccc(n2)-c2cnn3ncccc23)c1
: