Target
Cyclin-dependent kinase 2
Ligand
BDBM50293160
Substrate
Meas. Tech.
ChEMBL_496926 (CHEMBL1002021)
IC50
230±n/a nM
Citation
 Stevens, KLReno, MJAlberti, JBPrice, DJKane-Carson, LSKnick, VBShewchuk, LMHassell, AMVeal, JMDavis, STGriffin, RJPeel, MR Synthesis and evaluation of pyrazolo[1,5-b]pyridazines as selective cyclin dependent kinase inhibitors. Bioorg Med Chem Lett 18:5758-62 (2009)  
Target
Name:
Cyclin-dependent kinase 2
Synonyms:
CDK2 CDK2_HUMAN Cell division protein kinase 2 Protein cereblon/Cyclin-dependent kinase 2 | p33 protein kinase
Type:
Enzyme Subunit
Mol. Mass.:
33938.17
Organism:
Homo sapiens (Human)
Description:
P24941
Residue:
298
  
Inhibitor
Name:
BDBM50293160
Synonyms:
4-(6-isopropoxypyrazolo[1,5-b]pyridazin-3-yl)-N-(4-(4-methylpiperazin-1-yl)phenyl)pyrimidin-2-amine | CHEMBL496162
Type:
Small organic molecule
Emp. Form.:
C24H28N8O
Mol. Mass.:
444.5321
SMILES:
CC(C)Oc1ccc2c(cnn2n1)-c1ccnc(Nc2ccc(cc2)N2CCN(C)CC2)n1
: