Target
Cyclin-dependent kinase 4
Ligand
BDBM50293162
Substrate
Meas. Tech.
ChEMBL_496923 (CHEMBL1002018)
IC50
80±n/a nM
Citation
 Stevens, KLReno, MJAlberti, JBPrice, DJKane-Carson, LSKnick, VBShewchuk, LMHassell, AMVeal, JMDavis, STGriffin, RJPeel, MR Synthesis and evaluation of pyrazolo[1,5-b]pyridazines as selective cyclin dependent kinase inhibitors. Bioorg Med Chem Lett 18:5758-62 (2009)  
Target
Name:
Cyclin-dependent kinase 4
Synonyms:
CDK4 Cell division protein kinase 4 PSK-J3
Type:
Enzyme Subunit
Mol. Mass.:
33731.96
Organism:
Homo sapiens (Human)
Description:
P11802
Residue:
303
  
Inhibitor
Name:
BDBM50293162
Synonyms:
CHEMBL525194 N-cyclopropyl-4-pyrazolo[1,5-b]pyridazin-3-ylpyrimidin-2-amine
Type:
Small organic molecule
Emp. Form.:
C13H12N6
Mol. Mass.:
252.2746
SMILES:
C1CC1Nc1nccc(n1)-c1cnn2ncccc12
: