Target
Proto-oncogene tyrosine-protein kinase Src
Ligand
BDBM50293682
Substrate
Meas. Tech.
ChEMBL_571642 (CHEMBL1031297)
Ki
>38±n/a nM
Citation
 Bebbington, DBinch, HCharrier, JDEveritt, SFraysse, DGolec, JKay, DKnegtel, RMak, CMazzei, FMiller, AMortimore, MO'Donnell, MPatel, SPierard, FPinder, JPollard, JRamaya, SRobinson, DRutherford, AStudley, JWestcott, J The discovery of the potent aurora inhibitor MK-0457 (VX-680). Bioorg Med Chem Lett 19:3586-92 (2009)  
Target
Name:
Proto-oncogene tyrosine-protein kinase Src
Synonyms:
Calmodulin/Proto-oncogene tyrosine-protein kinase Src Proto-oncogene c-Src SRC SRC_HUMAN V-src sarcoma (Schmidt-Ruppin A-2) viral oncogene homolog (avian) p60-Src | pp60c-src
Type:
Protein
Mol. Mass.:
59838.60
Organism:
Homo sapiens (Human)
Description:
P12931
Residue:
536
  
Inhibitor
Name:
BDBM50293682
Synonyms:
2-(3,4-dichlorophenylthio)-N-(5-methyl-1H-pyrazol-3-yl)quinazolin-4-amine | CHEMBL552385
Type:
Small organic molecule
Emp. Form.:
C18H13Cl2N5S
Mol. Mass.:
402.3
SMILES:
Cc1cc(Nc2nc(Sc3ccc(Cl)c(Cl)c3)nc3ccccc23)[nH]n1
: