Target
Beta-lactamase OXA-10
Ligand
BDBM50293712
Substrate
Meas. Tech.
ChEMBL_571867 (CHEMBL1034735)
pH
7±n/a
Ki
95000±n/a nM
Comments
extracted
Citation
 Beck, JVercheval, LBebrone, CHerteg-Fernea, ALassaux, PMarchand-Brynaert, J Discovery of novel lipophilic inhibitors of OXA-10 enzyme (class D beta-lactamase) by screening amino analogs and homologs of citrate and isocitrate. Bioorg Med Chem Lett 19:3593-7 (2009)  
Target
Name:
Beta-lactamase OXA-10
Synonyms:
BLO10_PSEAI oxa10 | pse2
Type:
PROTEIN
Mol. Mass.:
29508.45
Organism:
Pseudomonas aeruginosa
Description:
ChEMBL_571868
Residue:
266
  
Inhibitor
Name:
BDBM50293712
Synonyms:
CHEMBL561821 | Tribenzyl 2-aminopropane-1,2,3-tricarboxylate
Type:
Small organic molecule
Emp. Form.:
C27H27NO6
Mol. Mass.:
461.5064
SMILES:
NC(CC(=O)OCc1ccccc1)(CC(=O)OCc1ccccc1)C(=O)OCc1ccccc1
: