Target
Metabotropic glutamate receptor 4
Ligand
BDBM50293730
Substrate
Meas. Tech.
ChEMBL_571886 (CHEMBL1034756)
EC50
>10000±n/a nM
Citation
 Engers, DWNiswender, CMWeaver, CDJadhav, SMenon, UNZamorano, RConn, PJLindsley, CWHopkins, CR Synthesis and evaluation of a series of heterobiarylamides that are centrally penetrant metabotropic glutamate receptor 4 (mGluR4) positive allosteric modulators (PAMs). J Med Chem 52:4115-8 (2009)  
Target
Name:
Metabotropic glutamate receptor 4
Synonyms:
GPRC1D GRM4_HUMAN MGLUR4 Metabotropic glutamate receptor 4 (mGlu4) metabotropic glutamate 4
Type:
Protein
Mol. Mass.:
101899.95
Organism:
Homo sapiens (Human)
Description:
Q14833
Residue:
912
  
Inhibitor
Name:
BDBM50293730
Synonyms:
CHEMBL557686 | N-(3,4-dichlorophenyl)cyclohexanecarboxamide
Type:
Small organic molecule
Emp. Form.:
C13H15Cl2NO
Mol. Mass.:
272.17
SMILES:
Clc1ccc(NC(=O)C2CCCCC2)cc1Cl
: