Target
Kinesin-like protein KIF3B
Ligand
BDBM50293757
Substrate
Meas. Tech.
ChEMBL_571922 (CHEMBL1035571)
IC50
>50000±n/a nM
Citation
 Lahue, BRMa, YShipps, GWSeghezzi, WHerbst, R Substituted benzimidazoles: A novel chemotype for small molecule hKSP inhibitors. Bioorg Med Chem Lett 19:3405-9 (2009)  
Target
Name:
Kinesin-like protein KIF3B
Synonyms:
KIAA0359 KIF3B_HUMAN
Type:
PROTEIN
Mol. Mass.:
85132.22
Organism:
Homo sapiens (Human)
Description:
ChEMBL_571922
Residue:
747
  
Inhibitor
Name:
BDBM50293757
Synonyms:
2-(4-sulfamoylphenylamino)-1-(2-(trifluoromethyl)benzyl)-1H-benzo[d]imidazole-5-carboxylic acid | CHEMBL561756
Type:
Small organic molecule
Emp. Form.:
C22H17F3N4O4S
Mol. Mass.:
490.455
SMILES:
NS(=O)(=O)c1ccc(Nc2nc3cc(ccc3n2Cc2ccccc2C(F)(F)F)C(O)=O)cc1
: