Target
Glutamate receptor ionotropic, NMDA 1
Ligand
BDBM50414372
Substrate
Meas. Tech.
ChEMBL_576091 (CHEMBL1057732)
IC50
370000±n/a nM
Citation
 Nguyen, KTLuethi, ESyed, SUrwyler, SBertrand, SBertrand, DReymond, JL 3-(aminomethyl)piperazine-2,5-dione as a novel NMDA glycine site inhibitor from the chemical universe database GDB. Bioorg Med Chem Lett 19:3832-5 (2009)  
Target
Name:
Glutamate receptor ionotropic, NMDA 1
Synonyms:
Glutamate (NMDA) receptor subunit zeta 1 Glutamate-NMDA-Channel Glutamate-NMDA-Polyamine NMDA Nmdar1 | phencyclidine
Type:
Enzyme Catalytic Domain
Mol. Mass.:
105533.40
Organism:
RAT
Description:
P35439
Residue:
938
  
Inhibitor
Name:
BDBM50414372
Synonyms:
CHEMBL2145458
Type:
Small organic molecule
Emp. Form.:
C5H9N3O2
Mol. Mass.:
143.1439
SMILES:
NC[C@@H]1NC(=O)CNC1=O
: