Target
Bifunctional epoxide hydrolase 2
Ligand
BDBM50295098
Substrate
Meas. Tech.
ChEMBL_573556 (CHEMBL1063935)
IC50
8110±n/a nM
Citation
 Falck, JRKodela, RManne, RAtcha, KRPuli, NDubasi, NManthati, VLCapdevila, JHYi, XYGoldman, DHMorisseau, CHammock, BDCampbell, WB 14,15-Epoxyeicosa-5,8,11-trienoic acid (14,15-EET) surrogates containing epoxide bioisosteres: influence upon vascular relaxation and soluble epoxide hydrolase inhibition. J Med Chem 52:5069-75 (2010)  
Target
Name:
Bifunctional epoxide hydrolase 2
Synonyms:
Cytosolic epoxide hydrolase 2 EPHX2 HYES_HUMAN Soluble epoxide hydrolase (sEH) | epoxide hydrolase 2, cytoplasmic
Type:
Enzyme
Mol. Mass.:
62613.07
Organism:
Homo sapiens (Human)
Description:
P34913
Residue:
555
  
Inhibitor
Name:
BDBM50295098
Synonyms:
9-(3-n-Pentylureido)non-4-ynoic acid | CHEMBL551900
Type:
Small organic molecule
Emp. Form.:
C15H26N2O3
Mol. Mass.:
282.3785
SMILES:
CCCCCNC(=O)NCCCCC#CCCC(O)=O
: