Target
Neuropeptide Y receptor type 2
Ligand
BDBM50414450
Substrate
Meas. Tech.
ChEMBL_578216 (CHEMBL1062219)
Ki
125.89±n/a nM
Citation
 Lunniss, GEBarnes, AABarton, NBiagetti, MBianchi, FBlowers, SMCaberlotto, LEmmons, AHolmes, IPMontanari, DNorris, RWalters, DJWatson, SP The identification and optimisation of novel and selective diamide neuropeptide Y Y2 receptor antagonists. Bioorg Med Chem Lett 19:4022-5 (2009)  
Target
Name:
Neuropeptide Y receptor type 2
Synonyms:
NPY-Y2 NPY2-R NPY2R_HUMAN Y2 receptor | neuropeptide Y receptor Y2
Type:
Enzyme Catalytic Domain
Mol. Mass.:
42734.65
Organism:
Homo sapiens (Human)
Description:
NPY-Y2 NPY2R HUMAN::P49146
Residue:
381
  
Inhibitor
Name:
BDBM50414450
Synonyms:
CHEMBL549895
Type:
Small organic molecule
Emp. Form.:
C23H25ClF3N3O2
Mol. Mass.:
467.912
SMILES:
CC(C)(C)C(=O)Nc1ccc(N2CCN(CC2)C(=O)c2cccc(c2)C(F)(F)F)c(Cl)c1
: