Target
ATP-binding cassette sub-family C member 2
Ligand
BDBM50241084
Substrate
Meas. Tech.
ChEMBL_579094 (CHEMBL1062296)
IC50
>50000±n/a nM
Citation
 Wong, ILChan, KFTsang, KHLam, CYZhao, YChan, THChow, LM Modulation of multidrug resistance protein 1 (MRP1/ABCC1)-mediated multidrug resistance by bivalent apigenin homodimers and their derivatives. J Med Chem 52:5311-22 (2009)  
Target
Name:
ATP-binding cassette sub-family C member 2
Synonyms:
ABCC2 CMOAT CMRP Canalicular multispecific organic anion transporter 1 MRP2 Multidrug resistance-associated protein 2 Multidrug resistance-associated protein 3 (MRP3)
Type:
Protein
Mol. Mass.:
174229.45
Organism:
Homo sapiens (Human)
Description:
Q92887
Residue:
1545
  
Inhibitor
Name:
BDBM50241084
Synonyms:
3'-Methoxyapigenin 5,7-dihydroxy-2-(4-hydroxy-3-methoxyphenyl)-4-benzopyrone 5,7-dihydroxy-2-(4-hydroxy-3-methoxyphenyl)-4H-chromen-4-one Chryseriol Chrysoeriol (26) cid_5280666
Type:
Small organic molecule
Emp. Form.:
C16H12O6
Mol. Mass.:
300.2629
SMILES:
COc1cc(ccc1O)-c1cc(=O)c2c(O)cc(O)cc2o1
: