Target
Enoyl-acyl-carrier protein reductase
Ligand
BDBM25426
Substrate
Meas. Tech.
ChEMBL_577751 (CHEMBL1053058)
IC50
840±n/a nM
Citation
 Frecer, VMegnassan, EMiertus, S Design and in silico screening of combinatorial library of antimalarial analogs of triclosan inhibiting Plasmodium falciparum enoyl-acyl carrier protein reductase. Eur J Med Chem 44:3009-19 (2009)  
Target
Name:
Enoyl-acyl-carrier protein reductase
Synonyms:
Type:
PROTEIN
Mol. Mass.:
49770.86
Organism:
Plasmodium falciparum
Description:
ChEMBL_795989
Residue:
432
  
Inhibitor
Name:
BDBM25426
Synonyms:
2-(2,4-dichlorophenoxy)-5-(pyridin-3-ylmethyl)phenol | Triclosan derivative, 27
Type:
Small organic molecule
Emp. Form.:
C18H13Cl2NO2
Mol. Mass.:
346.207
SMILES:
Oc1cc(Cc2cccnc2)ccc1Oc1ccc(Cl)cc1Cl
: