Target
Histamine H3 receptor
Ligand
BDBM50296178
Substrate
Meas. Tech.
ChEMBL_579538 (CHEMBL1061547)
IC50
0.16±n/a nM
Citation
 Sasaki, TTakahashi, TNagase, TMizutani, TIto, SMitobe, YMiyamoto, YKanesaka, MYoshimoto, RTanaka, TTakenaga, NTokita, SSato, N Synthesis, structure-activity relationships, and biological profiles of a dihydrobenzoxathiin class of histamine H(3) receptor inverse agonists. Bioorg Med Chem Lett 19:4232-6 (2009)  
Target
Name:
Histamine H3 receptor
Synonyms:
G-protein coupled receptor 97 HH3R HRH3 Histamine H3 receptor (H3) Histamine receptor (H3 and H4)
Type:
G Protein-Coupled Receptor (GPCR)
Mol. Mass.:
48691.47
Organism:
Homo sapiens (Human)
Description:
Binding assays were using CHO cells stably expressing hH3R receptors.
Residue:
445
  
Inhibitor
Name:
BDBM50296178
Synonyms:
(+/-)-(S)-1-{3-[4-(8-Methoxy-3-methyl-4,4-dioxo-3,4-dihydro-2H-4lambda*6*-benzo[1,4]oxathiin-2-yl)-phenoxy]-propyl}-3-methyl-piperidine | CHEMBL550517
Type:
Small organic molecule
Emp. Form.:
C25H33NO5S
Mol. Mass.:
459.598
SMILES:
COc1cccc2c1OC(C(C)S2(=O)=O)c1ccc(OCCCN2CCC[C@H](C)C2)cc1
: