Target
Potassium voltage-gated channel subfamily H member 2
Ligand
BDBM50296178
Substrate
Meas. Tech.
ChEMBL_579539 (CHEMBL1061548)
IC50
2500±n/a nM
Citation
 Sasaki, TTakahashi, TNagase, TMizutani, TIto, SMitobe, YMiyamoto, YKanesaka, MYoshimoto, RTanaka, TTakenaga, NTokita, SSato, N Synthesis, structure-activity relationships, and biological profiles of a dihydrobenzoxathiin class of histamine H(3) receptor inverse agonists. Bioorg Med Chem Lett 19:4232-6 (2009)  
Target
Name:
Potassium voltage-gated channel subfamily H member 2
Synonyms:
1,3-beta-glucan synthase component GLS2 ERG Eag-related protein 1 Ether-a-go-go-related gene (HERG) Ether-a-go-go-related gene potassium channel 1 Ether-a-go-go-related gene potassium channel 1 (hERG1) Ether-a-go-go-related protein 1 H-ERG KCNH2 Potassium voltage-gated channel subfamily H member 2 (hERG) Voltage-gated potassium channel subunit Kv11.1 hERG Potassium Channel 1 | putative potassium channel subunit
Type:
Multi-pass membrane protein
Mol. Mass.:
126672.65
Organism:
Homo sapiens (Human)
Description:
Q12809
Residue:
1159
  
Inhibitor
Name:
BDBM50296178
Synonyms:
(+/-)-(S)-1-{3-[4-(8-Methoxy-3-methyl-4,4-dioxo-3,4-dihydro-2H-4lambda*6*-benzo[1,4]oxathiin-2-yl)-phenoxy]-propyl}-3-methyl-piperidine | CHEMBL550517
Type:
Small organic molecule
Emp. Form.:
C25H33NO5S
Mol. Mass.:
459.598
SMILES:
COc1cccc2c1OC(C(C)S2(=O)=O)c1ccc(OCCCN2CCC[C@H](C)C2)cc1
: