Target
Hydroxycarboxylic acid receptor 3
Ligand
BDBM50414498
Substrate
Meas. Tech.
ChEMBL_579670 (CHEMBL1064090)
EC50
8710±n/a nM
Citation
 Skinner, PJWebb, PJSage, CRDang, THPride, CCChen, RTamura, SYRichman, JGConnolly, DTSemple, G 5-N,N-Disubstituted 5-aminopyrazole-3-carboxylic acids are highly potent agonists of GPR109b. Bioorg Med Chem Lett 19:4207-9 (2009)  
Target
Name:
Hydroxycarboxylic acid receptor 3
Synonyms:
G-protein coupled receptor 109B G-protein coupled receptor HM74B HCA3 HCAR3_HUMAN HM74B NIACR2 Nicotinic acid receptor 2
Type:
Enzyme Catalytic Domain
Mol. Mass.:
44498.06
Organism:
Homo sapiens (Human)
Description:
GPR109B 0 HUMAN::P49019
Residue:
387
  
Inhibitor
Name:
BDBM50414498
Synonyms:
CHEMBL550563
Type:
Small organic molecule
Emp. Form.:
C18H15F2N3O2
Mol. Mass.:
343.3274
SMILES:
OC(=O)c1cc([nH]n1)N(Cc1ccccc1F)Cc1ccccc1F
: