Target
Hydroxycarboxylic acid receptor 3
Ligand
BDBM50414502
Substrate
Meas. Tech.
ChEMBL_579670 (CHEMBL1064090)
EC50
3981±n/a nM
Citation
 Skinner, PJWebb, PJSage, CRDang, THPride, CCChen, RTamura, SYRichman, JGConnolly, DTSemple, G 5-N,N-Disubstituted 5-aminopyrazole-3-carboxylic acids are highly potent agonists of GPR109b. Bioorg Med Chem Lett 19:4207-9 (2009)  
Target
Name:
Hydroxycarboxylic acid receptor 3
Synonyms:
G-protein coupled receptor 109B G-protein coupled receptor HM74B HCA3 HCAR3_HUMAN HM74B NIACR2 Nicotinic acid receptor 2
Type:
Enzyme Catalytic Domain
Mol. Mass.:
44498.06
Organism:
Homo sapiens (Human)
Description:
GPR109B 0 HUMAN::P49019
Residue:
387
  
Inhibitor
Name:
BDBM50414502
Synonyms:
CHEMBL561720
Type:
Small organic molecule
Emp. Form.:
C12H17N3O2
Mol. Mass.:
235.2823
SMILES:
OC(=O)c1cc([nH]n1)N(CC1CC1)CC1CC1
: