Target
Tyrosinase
Ligand
BDBM50067028
Substrate
Meas. Tech.
ChEMBL_580596 (CHEMBL1054042)
IC50
>250000±n/a nM
Citation
 Lee, KHAb Aziz, FHSyahida, AAbas, FShaari, KIsraf, DALajis, NH Synthesis and biological evaluation of curcumin-like diarylpentanoid analogues for anti-inflammatory, antioxidant and anti-tyrosinase activities. Eur J Med Chem 44:3195-200 (2009)  
Target
Name:
Tyrosinase
Synonyms:
LB24-AB SK29-AB TYRO_HUMAN | Tumor rejection antigen AB
Type:
Protein
Mol. Mass.:
60388.08
Organism:
Homo sapiens (Human)
Description:
P14679
Residue:
529
  
Inhibitor
Name:
BDBM50067028
Synonyms:
(1E,4E)-1,5-Bis-(4-hydroxy-3-methoxy-phenyl)-penta-1,4-dien-3-one 1,5-Bis(4-hydroxy-3-methoxyphenyl)penta-1,4-dien-3-one 1,5-bis-(4-hydroxy-3-methoxyphenyl)-penta-1,4-dien-3-one Go-Y022
Type:
Small organic molecule
Emp. Form.:
C19H18O5
Mol. Mass.:
326.3432
SMILES:
COc1cc(\C=C\C(=O)\C=C\c2ccc(O)c(OC)c2)ccc1O
: