Target
Muscarinic acetylcholine receptor M3
Ligand
BDBM50297131
Substrate
Meas. Tech.
ChEMBL_581789 (CHEMBL1061576)
IC50
1059±n/a nM
Citation
 Wan, ZLaine, DIYan, HZhu, CWiddowson, KLBuckley, PTBurman, MFoley, JJSarau, HMSchmidt, DBWebb, EFBelmonte, KEPalovich, M Discovery of (3-endo)-3-(2-cyano-2,2-diphenylethyl)-8,8-dimethyl-8-azoniabicyclo[3.2.1]octane bromide as an efficacious inhaled muscarinic acetylcholine receptor antagonist for the treatment of COPD. Bioorg Med Chem Lett 19:4560-2 (2009)  
Target
Name:
Muscarinic acetylcholine receptor M3
Synonyms:
ACM3_HUMAN Cholinergic, muscarinic M3 Muscarinic receptor M3 | RecName: Full=Muscarinic acetylcholine receptor M3
Type:
Enzyme
Mol. Mass.:
66151.03
Organism:
Homo sapiens (Human)
Description:
P20309
Residue:
590
  
Inhibitor
Name:
BDBM50297131
Synonyms:
CHEMBL564143 | endo-N-(3-(8-methyl-8-azabicyclo[3.2.1]octan-3-yl)-2,2-diphenylpropyl)benzenesulfonamide
Type:
Small organic molecule
Emp. Form.:
C29H34N2O2S
Mol. Mass.:
474.657
SMILES:
CN1[C@@H]2CC[C@@H]1CC(CC(CNS(=O)(=O)c1ccccc1)(c1ccccc1)c1ccccc1)C2
: