Target
Probable C-C chemokine receptor type 3
Ligand
BDBM50264212
Substrate
Meas. Tech.
ChEMBL_581443 (CHEMBL1055687)
IC50
1100±n/a nM
Citation
 Sato, IMorihira, KInami, HKubota, HMorokata, TSuzuki, KOhno, KIura, YNitta, AImaoka, TTakahashi, TTakeuchi, MOhta, MTsukamoto, S Synthesis, biological evaluation, and metabolic stability of acrylamide derivatives as novel CCR3 antagonists. Bioorg Med Chem 17:5989-6002 (2009)  
Target
Name:
Probable C-C chemokine receptor type 3
Synonyms:
C-C CKR-3 CC-CKR-3 CCR3_MOUSE CKR3 Cmkbr1l2 MIP-1 alpha RL2 Probable C-C chemokine receptor type 3
Type:
PROTEIN
Mol. Mass.:
41791.57
Organism:
Mus musculus
Description:
ChEMBL_1445729
Residue:
359
  
Inhibitor
Name:
BDBM50264212
Synonyms:
CHEMBL519042 | N-{(3-exo)-8-[(6-Fluoro-2-naphthyl)methyl]-8-azabicyclo[3.2.1]oct-3-yl}-3-(piperidin-1-ylcarbonyl)isonicotinamide 1-oxide
Type:
Small organic molecule
Emp. Form.:
C30H33FN4O3
Mol. Mass.:
516.6064
SMILES:
[O-][n+]1ccc(C(=O)NC2C[C@H]3CC[C@H](C2)N3Cc2ccc3cc(F)ccc3c2)c(c1)C(=O)N1CCCCC1
: