Target
Kappa-type opioid receptor
Ligand
BDBM50297345
Substrate
Meas. Tech.
ChEMBL_583151 (CHEMBL1062530)
EC50
0.8±n/a nM
Citation
 Fang, WJCui, YMurray, TFAldrich, JV Design, synthesis, and pharmacological activities of dynorphin A analogues cyclized by ring-closing metathesis. J Med Chem 52:5619-25 (2009)  
Target
Name:
Kappa-type opioid receptor
Synonyms:
KOR-1 OPIATE Kappa Opioid receptor Ror-d
Type:
G Protein-Coupled Receptor (GPCR)
Mol. Mass.:
42692.90
Organism:
Rattus norvegicus (rat)
Description:
P34975
Residue:
380
  
Inhibitor
Name:
BDBM50297345
Synonyms:
(5S,8S,13R,Z)-13-((S)-2-amino-3-(4-hydroxyphenyl)propanamido)-5-benzyl-N-((6S,9S,12S,15S)-1,20-diamino-9-sec-butyl-6-((S)-2-((S)-1,6-diamino-1-oxohexan-2-ylcarbamoyl)pyrrolidine-1-carbonyl)-12-(3-guanidinopropyl)-1,20-diimino-8,11,14-trioxo-2,7,10,13,19-pentaazaicosan-15-yl)-3,6,14-trioxo-1,4,7-triazacyclotetradec-10-ene-8-carboxamide | CHEMBL550968
Type:
Small organic molecule
Emp. Form.:
C63H100N22O12
Mol. Mass.:
1357.6083
SMILES:
[#6]-[#6]-[#6@H](-[#6])-[#6@H](-[#7]-[#6](=O)-[#6@H](-[#6]-[#6]-[#6]\[#7]=[#6](\[#7])-[#7])-[#7]-[#6](=O)-[#6@H](-[#6]-[#6]-[#6]\[#7]=[#6](\[#7])-[#7])-[#7]-[#6](=O)-[#6@@H]-1-[#6]-[#6]=[#6]-[#6]-[#6@@H](-[#7]-[#6](=O)-[#6@@H](-[#7])-[#6]-c2ccc(-[#8])cc2)-[#6](=O)-[#7]-[#6]-[#6](=O)-[#7]-[#6@@H](-[#6]-c2ccccc2)-[#6](=O)-[#7]-1)-[#6](=O)-[#7]-[#6@@H](-[#6]-[#6]-[#6]\[#7]=[#6](\[#7])-[#7])-[#6](=O)-[#7]-1-[#6]-[#6]-[#6]-[#6@H]-1-[#6](=O)-[#7]-[#6@@H](-[#6]-[#6]-[#6]-[#6]-[#7])-[#6](-[#7])=O
: