Target
Kappa-type opioid receptor
Ligand
BDBM50010704
Substrate
Meas. Tech.
ChEMBL_583151 (CHEMBL1062530)
EC50
0.39±n/a nM
Citation
 Fang, WJCui, YMurray, TFAldrich, JV Design, synthesis, and pharmacological activities of dynorphin A analogues cyclized by ring-closing metathesis. J Med Chem 52:5619-25 (2009)  
Target
Name:
Kappa-type opioid receptor
Synonyms:
KOR-1 OPIATE Kappa Opioid receptor Ror-d
Type:
G Protein-Coupled Receptor (GPCR)
Mol. Mass.:
42692.90
Organism:
Rattus norvegicus (rat)
Description:
P34975
Residue:
380
  
Inhibitor
Name:
BDBM50010704
Synonyms:
CHEMBL216640 Dynorphin A analogues HTyr-Gly-Gly-Phe-Leu-Arg-Arg-lle-Arg-Pro-LysNH2 Tyr-Gly-Gly-Phe-Leu-Arg-Arg-Ile-Arg-Pro-D-Lys-NH2 | Tyr-Gly-Gly-Phe-Leu-Arg-Arg-Ile-Arg-Pro-Lys-Leu-Lys-Trp-Asp-Asn-Gln-NH2
Type:
Small organic molecule
Emp. Form.:
C63H104N22O12
Mol. Mass.:
1361.6401
SMILES:
CC[C@H](C)[C@H](NC(=O)[C@H](CCCNC(N)=N)NC(=O)[C@H](CCCNC(N)=N)NC(=O)[C@H](CC(C)C)NC(=O)[C@H](Cc1ccccc1)NC(=O)CNC(=O)CNC(=O)[C@@H](N)Cc1ccc(O)cc1)C(=O)N[C@@H](CCCNC(N)=N)C(=O)N1CCC[C@H]1C(=O)N[C@@H](CCCCN)C(N)=O
: