Target
Histone deacetylase 9
Ligand
BDBM50297448
Substrate
Meas. Tech.
ChEMBL_585892 (CHEMBL1053563)
IC50
50000.00±n/a nM
Citation
 Giannini, GMarzi, MMarzo, MDBattistuzzi, GPezzi, RBrunetti, TCabri, WVesci, LPisano, C Exploring bis-(indolyl)methane moiety as an alternative and innovative CAP group in the design of histone deacetylase (HDAC) inhibitors. Bioorg Med Chem Lett 19:2840-3 (2009)  
Target
Name:
Histone deacetylase 9
Synonyms:
HD9 HDAC7B HDAC9_HUMAN Histone acetylase 9 (HDAC9) Histone deacetylase 9 (HDAC9) Human HDAC9 MITR
Type:
Enzyme
Mol. Mass.:
111304.31
Organism:
Homo sapiens (Human)
Description:
Q9UKV0
Residue:
1011
  
Inhibitor
Name:
BDBM50297448
Synonyms:
CHEMBL564916 ST-3071
Type:
Small organic molecule
Emp. Form.:
C29H30N4O
Mol. Mass.:
450.5747
SMILES:
Nc1ccccc1NC(=O)CCCCCC(c1c[nH]c2ccccc12)c1c[nH]c2ccccc12
: