Target
Prostaglandin G/H synthase 2
Ligand
BDBM50297691
Substrate
Meas. Tech.
ChEMBL_583892 (CHEMBL1059944)
IC50
33±n/a nM
Citation
 Swarbrick, MEBeswick, PJGleave, RJGreen, RHBingham, SBountra, CCarter, MCChambers, LJChessell, IPClayton, NMCollins, SDCorfield, JAHartley, CDKleanthous, SLambeth, PFLucas, FSMathews, NNaylor, APage, LWPayne, JJPegg, NAPrice, HSSkidmore, JStevens, AJStocker, RStratton, SCStuart, AJWiseman, JO Identification of [4-[4-(methylsulfonyl)phenyl]-6-(trifluoromethyl)-2-pyrimidinyl] amines and ethers as potent and selective cyclooxygenase-2 inhibitors. Bioorg Med Chem Lett 19:4504-8 (2009)  
Target
Name:
Prostaglandin G/H synthase 2
Synonyms:
COX2 Cyclooxygenase 2 (COX-2) Cyclooxygenase-2 (COX-2 AA) Cyclooxygenase-2 (COX-2) PGH2_HUMAN PHS II Prostaglandin E synthase/G/H synthase 2 Prostaglandin-endoperoxide synthase 2
Type:
Enzyme
Mol. Mass.:
69003.89
Organism:
Homo sapiens (Human)
Description:
Recombinant Cox-2 provided by Cayman (Cayman Chemical Co.,Ann Arbor, MI).
Residue:
604
  
Inhibitor
Name:
BDBM50297691
Synonyms:
2-tert-butoxy-4-(4-(methylsulfonyl)phenyl)-6-(trifluoromethyl)pyrimidine | CHEMBL550537
Type:
Small organic molecule
Emp. Form.:
C16H17F3N2O3S
Mol. Mass.:
374.378
SMILES:
CC(C)(C)Oc1nc(cc(n1)C(F)(F)F)-c1ccc(cc1)S(C)(=O)=O
: