Target
Muscarinic acetylcholine receptor M1
Ligand
BDBM50297867
Substrate
Meas. Tech.
ChEMBL_584294 (CHEMBL1060928)
Ki
2745±n/a nM
Citation
 Coon, TMoree, WJLi, BYu, JZamani-Kord, SMalany, SSantos, MAHernandez, LMPetroski, RESun, AWen, JSullivan, SHaelewyn, JHedrick, MHoare, SJBradbury, MJCrowe, PDBeaton, G Brain-penetrating 2-aminobenzimidazole H(1)-antihistamines for the treatment of insomnia. Bioorg Med Chem Lett 19:4380-4 (2009)  
Target
Name:
Muscarinic acetylcholine receptor M1
Synonyms:
ACM1_HUMAN Cholinergic receptor, muscarinic 1 | Cholinergic, muscarinic M1
Type:
Protein
Mol. Mass.:
51442.54
Organism:
Homo sapiens (Human)
Description:
P11229
Residue:
460
  
Inhibitor
Name:
BDBM50297867
Synonyms:
CHEMBL558933 | N-cyclohexyl-1-(1-(4-fluorobenzyl)-1H-benzo[d]imidazol-2-yl)-N-methylpiperidin-4-amine
Type:
Small organic molecule
Emp. Form.:
C26H33FN4
Mol. Mass.:
420.5654
SMILES:
CN(C1CCCCC1)C1CCN(CC1)c1nc2ccccc2n1Cc1ccc(F)cc1
: