Target
Potassium voltage-gated channel subfamily H member 2
Ligand
BDBM50297854
Substrate
Meas. Tech.
ChEMBL_584297 (CHEMBL1060931)
Ki
>7500±n/a nM
Citation
 Coon, TMoree, WJLi, BYu, JZamani-Kord, SMalany, SSantos, MAHernandez, LMPetroski, RESun, AWen, JSullivan, SHaelewyn, JHedrick, MHoare, SJBradbury, MJCrowe, PDBeaton, G Brain-penetrating 2-aminobenzimidazole H(1)-antihistamines for the treatment of insomnia. Bioorg Med Chem Lett 19:4380-4 (2009)  
Target
Name:
Potassium voltage-gated channel subfamily H member 2
Synonyms:
1,3-beta-glucan synthase component GLS2 ERG Eag-related protein 1 Ether-a-go-go-related gene (HERG) Ether-a-go-go-related gene potassium channel 1 Ether-a-go-go-related gene potassium channel 1 (hERG1) Ether-a-go-go-related protein 1 H-ERG KCNH2 Potassium voltage-gated channel subfamily H member 2 (hERG) Voltage-gated potassium channel subunit Kv11.1 hERG Potassium Channel 1 | putative potassium channel subunit
Type:
Multi-pass membrane protein
Mol. Mass.:
126672.65
Organism:
Homo sapiens (Human)
Description:
Q12809
Residue:
1159
  
Inhibitor
Name:
BDBM50297854
Synonyms:
1'-(1-(4-fluorobenzyl)-1H-benzo[d]imidazol-2-yl)-1,4'-bipiperidin-2-one | CHEMBL552026
Type:
Small organic molecule
Emp. Form.:
C24H27FN4O
Mol. Mass.:
406.4958
SMILES:
Fc1ccc(Cn2c(nc3ccccc23)N2CCC(CC2)N2CCCCC2=O)cc1
: