Target
Histamine H1 receptor
Ligand
BDBM50297857
Substrate
Meas. Tech.
ChEMBL_584293 (CHEMBL1060927)
Ki
4.5±n/a nM
Citation
 Coon, TMoree, WJLi, BYu, JZamani-Kord, SMalany, SSantos, MAHernandez, LMPetroski, RESun, AWen, JSullivan, SHaelewyn, JHedrick, MHoare, SJBradbury, MJCrowe, PDBeaton, G Brain-penetrating 2-aminobenzimidazole H(1)-antihistamines for the treatment of insomnia. Bioorg Med Chem Lett 19:4380-4 (2009)  
Target
Name:
Histamine H1 receptor
Synonyms:
H1R HISTAMINE H1 HRH1_HUMAN
Type:
G Protein-Coupled Receptor (GPCR)
Mol. Mass.:
55808.72
Organism:
Homo sapiens (Human)
Description:
Cell pellets from SK-N-MC cells transfected with human H1 receptor were used in binding assay.
Residue:
487
  
Inhibitor
Name:
BDBM50297857
Synonyms:
1-(1-(4-fluorobenzyl)-1H-benzo[d]imidazol-2-yl)-N-((tetrahydro-2H-pyran-4-yl)methyl)piperidin-4-amine | CHEMBL559060
Type:
Small organic molecule
Emp. Form.:
C25H31FN4O
Mol. Mass.:
422.5382
SMILES:
Fc1ccc(Cn2c(nc3ccccc23)N2CCC(CC2)NCC2CCOCC2)cc1
: