Target
Potassium voltage-gated channel subfamily H member 2
Ligand
BDBM50297863
Substrate
Meas. Tech.
ChEMBL_584297 (CHEMBL1060931)
Ki
73±n/a nM
Citation
 Coon, TMoree, WJLi, BYu, JZamani-Kord, SMalany, SSantos, MAHernandez, LMPetroski, RESun, AWen, JSullivan, SHaelewyn, JHedrick, MHoare, SJBradbury, MJCrowe, PDBeaton, G Brain-penetrating 2-aminobenzimidazole H(1)-antihistamines for the treatment of insomnia. Bioorg Med Chem Lett 19:4380-4 (2009)  
Target
Name:
Potassium voltage-gated channel subfamily H member 2
Synonyms:
1,3-beta-glucan synthase component GLS2 ERG Eag-related protein 1 Ether-a-go-go-related gene (HERG) Ether-a-go-go-related gene potassium channel 1 Ether-a-go-go-related gene potassium channel 1 (hERG1) Ether-a-go-go-related protein 1 H-ERG KCNH2 Potassium voltage-gated channel subfamily H member 2 (hERG) Voltage-gated potassium channel subunit Kv11.1 hERG Potassium Channel 1 | putative potassium channel subunit
Type:
Multi-pass membrane protein
Mol. Mass.:
126672.65
Organism:
Homo sapiens (Human)
Description:
Q12809
Residue:
1159
  
Inhibitor
Name:
BDBM50297863
Synonyms:
CHEMBL563451 | N,N-dimethyl-1-(1-(4-methylbenzyl)-1H-benzo[d]imidazol-2-yl)piperidin-4-amine
Type:
Small organic molecule
Emp. Form.:
C22H28N4
Mol. Mass.:
348.4845
SMILES:
CN(C)C1CCN(CC1)c1nc2ccccc2n1Cc1ccc(C)cc1
: