Target
P2Y purinoceptor 12
Ligand
BDBM50298179
Substrate
Meas. Tech.
ChEMBL_585133 (CHEMBL1060022)
Ki
34±n/a nM
Citation
 Parlow, JJBurney, MWCase, BLGirard, TJHall, KAHiebsch, RRHuff, RMLachance, RMMischke, DARapp, SRWoerndle, RSEnnis, MD Piperazinyl-glutamate-pyridines as potent orally bioavailable P2Y12 antagonists for inhibition of platelet aggregation. Bioorg Med Chem Lett 19:4657-63 (2009)  
Target
Name:
P2Y purinoceptor 12
Synonyms:
ADP-glucose receptor HORK3 P2T(AC) P2Y(AC) P2Y(cyc) P2Y12 platelet ADP receptor Purinergic receptor P2Y12 | SP1999
Type:
Enzyme
Mol. Mass.:
39458.48
Organism:
Homo sapiens (Human)
Description:
Q9H244
Residue:
342
  
Inhibitor
Name:
BDBM50298179
Synonyms:
(4S)5-[4-(Ethoxycarbonyl)piperazin-1-yl]-5-oxo-4-({[6-phenyl-4-(4-pyrrolidin-1-ylpiperidin-1-yl)pyridin-2-yl]carbonyl}amino)pentanoic Acid CHEMBL540737
Type:
Small organic molecule
Emp. Form.:
C33H44N6O6
Mol. Mass.:
620.7391
SMILES:
CCOC(=O)N1CCN(CC1)C(=O)[C@H](CCC(O)=O)NC(=O)c1cc(cc(n1)-c1ccccc1)N1CCC(CC1)N1CCCC1
: