Target
5-hydroxytryptamine receptor 2C
Ligand
BDBM50298330
Substrate
Meas. Tech.
ChEMBL_588489 (CHEMBL1040387)
IC50
>10000±n/a nM
Citation
 Ahmed, AChoo, HCho, YSPark, WKPae, AN Identification of novel serotonin 2C receptor ligands by sequential virtual screening. Bioorg Med Chem 17:4559-68 (2009)  
Target
Name:
5-hydroxytryptamine receptor 2C
Synonyms:
5-HT-1C 5-HT1C 5-HT2C-INI 5-HTR2C 5-hydroxytryptamine receptor 2C (5-HT-2C) 5HT-1C HTR1C Serotonin (5-HT3) receptor Serotonin Receptor 2C
Type:
G Protein-Coupled Receptor (GPCR)
Mol. Mass.:
51836.79
Organism:
Homo sapiens (Human)
Description:
P28335
Residue:
458
  
Inhibitor
Name:
BDBM50298330
Synonyms:
CHEMBL574547 | N4-(4-fluorophenyl)-N6-(3-methoxypropyl)-1-methyl-1H-pyrazolo[3,4-d]pyrimidine-4,6-diamine
Type:
Small organic molecule
Emp. Form.:
C16H19FN6O
Mol. Mass.:
330.3601
SMILES:
COCCCNc1nc(Nc2ccc(F)cc2)c2cnn(C)c2n1
: