Target
RAC-alpha serine/threonine-protein kinase
Ligand
BDBM15095
Substrate
Meas. Tech.
ChEMBL_587680 (CHEMBL1049250)
IC50
79±n/a nM
Citation
 Dong, XJiang, CHu, HYan, JChen, JHu, Y QSAR study of Akt/protein kinase B (PKB) inhibitors using support vector machine. Eur J Med Chem 44:4090-7 (2009)  
Target
Name:
RAC-alpha serine/threonine-protein kinase
Synonyms:
AKT phosphorylation (p-AKT) AKT1/PPP1CA C-AKT PKB alpha Protein kinase B Protein kinase B (Akt 1) Protein kinase B alpha Proto-oncogene Akt (Akt1) Proto-oncogene c-Akt (AKT1) RAC-PK-alpha RAC-alpha serine/threonine-protein kinase (AKT1) | RAC-alpha serine/threonine-protein kinase (pAKT)
Type:
Enzyme
Mol. Mass.:
55681.25
Organism:
Homo sapiens (Human)
Description:
P31749
Residue:
480
  
Inhibitor
Name:
BDBM15095
Synonyms:
N-[(2S)-2-amino-3-(1H-indol-3-yl)propyl]-6-chloro-5-[(E)-2-(pyridin-4-yl)ethenyl]pyridin-3-amine | trans-bispyridinylethylene analog 16a
Type:
Small organic molecule
Emp. Form.:
C23H22ClN5
Mol. Mass.:
403.907
SMILES:
N[C@H](CNc1cnc(Cl)c(\C=C\c2ccncc2)c1)Cc1c[nH]c2ccccc12
: