Target
Adenosine receptor A2b
Ligand
BDBM50298553
Substrate
Meas. Tech.
ChEMBL_587705 (CHEMBL1037719)
IC50
5840±n/a nM
Citation
 Michielan, LBolcato, CFederico, SCacciari, BBacilieri, MKlotz, KNKachler, SPastorin, GCardin, RSperduti, ASpalluto, GMoro, S Combining selectivity and affinity predictions using an integrated Support Vector Machine (SVM) approach: An alternative tool to discriminate between the human adenosine A(2A) and A(3) receptor pyrazolo-triazolo-pyrimidine antagonists binding sites. Bioorg Med Chem 17:5259-74 (2009)  
Target
Name:
Adenosine receptor A2b
Synonyms:
AA2BR_HUMAN ADORA2B Adenosine receptors A2b | Adenosine receptors; A2a & A2b
Type:
G Protein-Coupled Receptor (GPCR)
Mol. Mass.:
36341.22
Organism:
Homo sapiens (Human)
Description:
Residue:
332
  
Inhibitor
Name:
BDBM50298553
Synonyms:
5-[(Diphenylmethyl)carbonyl]amino-8-(2-phenylethyl)-2-(2-furyl)-pyrazolo[4,3-e]1,2,4-triazolo[1,5-c]pyrimidine | CHEMBL573780
Type:
Small organic molecule
Emp. Form.:
C32H25N7O2
Mol. Mass.:
539.5866
SMILES:
O=C(Nc1nc2nn(CCc3ccccc3)cc2c2nc(nn12)-c1ccco1)C(c1ccccc1)c1ccccc1
: