Target
Adenosine receptor A2b
Ligand
BDBM50298537
Substrate
Meas. Tech.
ChEMBL_587705 (CHEMBL1037719)
IC50
9370±n/a nM
Citation
 Michielan, LBolcato, CFederico, SCacciari, BBacilieri, MKlotz, KNKachler, SPastorin, GCardin, RSperduti, ASpalluto, GMoro, S Combining selectivity and affinity predictions using an integrated Support Vector Machine (SVM) approach: An alternative tool to discriminate between the human adenosine A(2A) and A(3) receptor pyrazolo-triazolo-pyrimidine antagonists binding sites. Bioorg Med Chem 17:5259-74 (2009)  
Target
Name:
Adenosine receptor A2b
Synonyms:
AA2BR_HUMAN ADORA2B Adenosine receptors A2b | Adenosine receptors; A2a & A2b
Type:
G Protein-Coupled Receptor (GPCR)
Mol. Mass.:
36341.22
Organism:
Homo sapiens (Human)
Description:
Residue:
332
  
Inhibitor
Name:
BDBM50298537
Synonyms:
5-[(3-Thienylmethyl)carbonyl]amino-8-ethyl-2-(2-furyl)-pyrazolo[4,3-e]1,2,4-triazolo[1,5-c]pyrimidine | CHEMBL575198
Type:
Small organic molecule
Emp. Form.:
C18H15N7O2S
Mol. Mass.:
393.422
SMILES:
CCn1cc2c(n1)nc(NC(=O)Cc1ccsc1)n1nc(nc21)-c1ccco1
: