Target
Prostate-specific antigen
Ligand
BDBM50298738
Substrate
Meas. Tech.
ChEMBL_588029 (CHEMBL1048364)
Ki
3.9±n/a nM
Citation
 LeBeau, AMBanerjee, SRPomper, MGMease, RCDenmeade, SR Optimization of peptide-based inhibitors of prostate-specific antigen (PSA) as targeted imaging agents for prostate cancer. Bioorg Med Chem 17:4888-93 (2009)  
Target
Name:
Prostate-specific antigen
Synonyms:
APS KLK3 Kallikrein-3 PSA Prostate-specific antigen Seminin
Type:
PROTEIN
Mol. Mass.:
28747.53
Organism:
Homo sapiens (Human)
Description:
ChEMBL_959198
Residue:
261
  
Inhibitor
Name:
BDBM50298738
Synonyms:
CHEMBL583783 | benzyl(2S,5S,8S,11S,14S)-8-(3-amino-3-oxopropyl)-14-formyl-1-hydroxy-5-(hydroxymethyl)-11-isobutyl-16-methyl-3,6,9,12-tetraoxo-4,7,10,13-tetraazaheptadecan-2-ylcarbamate
Type:
Small organic molecule
Emp. Form.:
C31H48N6O10
Mol. Mass.:
664.747
SMILES:
CC(C)C[C@H](NC(=O)[C@H](CC(C)C)NC(=O)[C@H](CCC(N)=O)NC(=O)[C@H](CO)NC(=O)[C@H](CO)NC(=O)OCc1ccccc1)C=O
: