Target
Prostate-specific antigen
Ligand
BDBM50298757
Substrate
Meas. Tech.
ChEMBL_588029 (CHEMBL1048364)
Ki
5.6±n/a nM
Citation
 LeBeau, AMBanerjee, SRPomper, MGMease, RCDenmeade, SR Optimization of peptide-based inhibitors of prostate-specific antigen (PSA) as targeted imaging agents for prostate cancer. Bioorg Med Chem 17:4888-93 (2009)  
Target
Name:
Prostate-specific antigen
Synonyms:
APS KLK3 Kallikrein-3 PSA Prostate-specific antigen Seminin
Type:
PROTEIN
Mol. Mass.:
28747.53
Organism:
Homo sapiens (Human)
Description:
ChEMBL_959198
Residue:
261
  
Inhibitor
Name:
BDBM50298757
Synonyms:
(5S,8S,11S,14S,17R)-11-(4-aminobutyl)-5,8-bis(hydroxymethyl)-14-isobutyl-4,10,19-trimethyl-3,6,9,12,15-pentaoxo-1-phenyl-2-oxa-4,7,10,13,16-pentaazaicosan-17-ylboronic acid | CHEMBL574669
Type:
Small organic molecule
Emp. Form.:
C33H57BN6O10
Mol. Mass.:
708.651
SMILES:
CC(C)C[C@H](NC(=O)[C@H](CC(C)C)NC(=O)[C@H](CCCCN)N(C)C(=O)[C@H](CO)NC(=O)[C@H](CO)N(C)C(=O)OCc1ccccc1)B(O)O
: