Target
Plasmepsin I
Ligand
BDBM50209559
Substrate
Meas. Tech.
ChEMBL_588271 (CHEMBL1050928)
IC50
280±n/a nM
Citation
 Orrling, KMMarzahn, MRGutiérrez-de-Terán, HAqvist, JDunn, BMLarhed, M alpha-Substituted norstatines as the transition-state mimic in inhibitors of multiple digestive vacuole malaria aspartic proteases. Bioorg Med Chem 17:5933-49 (2009)  
Target
Name:
Plasmepsin I
Synonyms:
PFAPG PMI Plasmepsin-1 precursor
Type:
Enzyme
Mol. Mass.:
51463.30
Organism:
Plasmodium falciparum
Description:
Residue:
452
  
Inhibitor
Name:
BDBM50209559
Synonyms:
(4R)-3-[(2S,3S)-3-{[(2,6-dimethylphenoxy)acetyl]amino}-2-hydroxy-4-phenylbutanoyl]-N-[(1S,2R)-2-hydroxy-2,3-dihydro-1H-inden-1-yl]-5,5-dimethyl-1,3-thiazolidine-4-carboxamide CHEMBL231522 | KNI-10006
Type:
Small organic molecule
Emp. Form.:
C35H41N3O6S
Mol. Mass.:
631.782
SMILES:
Cc1cccc(C)c1OCC(=O)N[C@@H](Cc1ccccc1)[C@H](O)C(=O)N1CSC(C)(C)[C@H]1C(=O)N[C@@H]1[C@H](O)Cc2ccccc12
: