Target
Delta-type opioid receptor
Ligand
BDBM50299390
Substrate
Meas. Tech.
ChEMBL_590499 (CHEMBL1058546)
Ki
0.410000±n/a nM
Citation
 Griffin, AMBrown, WWalpole, CCoupal, MAdam, LGosselin, MSalois, DMorin, PERoumi, M Delta agonist hydroxy bioisosteres: the discovery of 3-((1-benzylpiperidin-4-yl){4-[(diethylamino)carbonyl]phenyl}amino)benzamide with improved delta agonist activity and in vitro metabolic stability. Bioorg Med Chem Lett 19:5999-6003 (2009)  
Target
Name:
Delta-type opioid receptor
Synonyms:
D-OR-1 Delta opioid receptor OPIATE Delta OPRD1 OPRK1 | opioid receptor, delta 1
Type:
G Protein-Coupled Receptor (GPCR)
Mol. Mass.:
40382.98
Organism:
Homo sapiens (Human)
Description:
Competition binding assays were carried out using membrane preparations from transfected HN9.10 cells that constitutively expressed the delta opioid receptor.
Residue:
372
  
Inhibitor
Name:
BDBM50299390
Synonyms:
CHEMBL574640 | Methyl 3-((1-benzylpiperidin-4-yl)(4-(diethylcarbamoyl)phenyl)amino)phenylcarbamate
Type:
Small organic molecule
Emp. Form.:
C31H38N4O3
Mol. Mass.:
514.6584
SMILES:
CCN(CC)C(=O)c1ccc(cc1)N(C1CCN(Cc2ccccc2)CC1)c1cccc(NC(=O)OC)c1
: