Target
Mu-type opioid receptor
Ligand
BDBM50299390
Substrate
Meas. Tech.
ChEMBL_590500 (CHEMBL1058547)
Ki
75±n/a nM
Citation
 Griffin, AMBrown, WWalpole, CCoupal, MAdam, LGosselin, MSalois, DMorin, PERoumi, M Delta agonist hydroxy bioisosteres: the discovery of 3-((1-benzylpiperidin-4-yl){4-[(diethylamino)carbonyl]phenyl}amino)benzamide with improved delta agonist activity and in vitro metabolic stability. Bioorg Med Chem Lett 19:5999-6003 (2009)  
Target
Name:
Mu-type opioid receptor
Synonyms:
M-OR-1 MOR-1 MUOR1 Mu opiate receptor OPRM1 hMOP | mu-type opioid receptor isoform MOR-1
Type:
G Protein-Coupled Receptor (GPCR)
Mol. Mass.:
44789.51
Organism:
Homo sapiens (Human)
Description:
P35372
Residue:
400
  
Inhibitor
Name:
BDBM50299390
Synonyms:
CHEMBL574640 | Methyl 3-((1-benzylpiperidin-4-yl)(4-(diethylcarbamoyl)phenyl)amino)phenylcarbamate
Type:
Small organic molecule
Emp. Form.:
C31H38N4O3
Mol. Mass.:
514.6584
SMILES:
CCN(CC)C(=O)c1ccc(cc1)N(C1CCN(Cc2ccccc2)CC1)c1cccc(NC(=O)OC)c1
: