Target
Kappa-type opioid receptor
Ligand
BDBM50299390
Substrate
Meas. Tech.
ChEMBL_590501 (CHEMBL1058548)
Ki
576±n/a nM
Citation
 Griffin, AMBrown, WWalpole, CCoupal, MAdam, LGosselin, MSalois, DMorin, PERoumi, M Delta agonist hydroxy bioisosteres: the discovery of 3-((1-benzylpiperidin-4-yl){4-[(diethylamino)carbonyl]phenyl}amino)benzamide with improved delta agonist activity and in vitro metabolic stability. Bioorg Med Chem Lett 19:5999-6003 (2009)  
Target
Name:
Kappa-type opioid receptor
Synonyms:
K-OR-1 Kappa-opioid receptor (KOR) Kappa-type opioid receptor (KOR) OPIATE Kappa OPRK1 kappa opioid receptor (KOR)
Type:
G Protein-Coupled Receptor (GPCR)
Mol. Mass.:
42648.76
Organism:
Homo sapiens (Human)
Description:
P41145
Residue:
380
  
Inhibitor
Name:
BDBM50299390
Synonyms:
CHEMBL574640 | Methyl 3-((1-benzylpiperidin-4-yl)(4-(diethylcarbamoyl)phenyl)amino)phenylcarbamate
Type:
Small organic molecule
Emp. Form.:
C31H38N4O3
Mol. Mass.:
514.6584
SMILES:
CCN(CC)C(=O)c1ccc(cc1)N(C1CCN(Cc2ccccc2)CC1)c1cccc(NC(=O)OC)c1
: