Target
Amine oxidase [flavin-containing] B
Ligand
BDBM50299435
Substrate
Meas. Tech.
ChEMBL_590725 (CHEMBL1049125)
IC50
15±n/a nM
Citation
 Pisani, LMuncipinto, GMiscioscia, TFNicolotti, OLeonetti, FCatto, MCaccia, CSalvati, PSoto-Otero, RMendez-Alvarez, EPasseleu, CCarotti, A Discovery of a novel class of potent coumarin monoamine oxidase B inhibitors: development and biopharmacological profiling of 7-[(3-chlorobenzyl)oxy]-4-[(methylamino)methyl]-2H-chromen-2-one methanesulfonate (NW-1772) as a highly potent, selective, reversible, and orally active monoamine oxidase B  J Med Chem 52:6685-706 (2009)  
Target
Name:
Amine oxidase [flavin-containing] B
Synonyms:
AOFB_RAT Amine oxidase [flavin-containing] B Monoamine Oxidase Type B (MAO-B) Monoamine oxidase B (MAO-B) Monoamine oxidase type B (MAOB) | Monoamine oxidase-B (MAO-B)
Type:
Enzyme
Mol. Mass.:
58469.65
Organism:
Rattus norvegicus (rat)
Description:
P19643
Residue:
520
  
Inhibitor
Name:
BDBM50299435
Synonyms:
4-(Aminomethyl)-7-[(3-chlorobenzyl)oxy]-2H-chromen-2-one | CHEMBL572534
Type:
Small organic molecule
Emp. Form.:
C17H14ClNO3
Mol. Mass.:
315.751
SMILES:
NCc1cc(=O)oc2cc(OCc3cccc(Cl)c3)ccc12
: