Target
Receptor-type tyrosine-protein phosphatase beta
Ligand
BDBM50118744
Substrate
Meas. Tech.
ChEMBL_590758 (CHEMBL1050900)
Ki
11000±n/a nM
Citation
 Vidovic, DSchürer, SC Knowledge-based characterization of similarity relationships in the human protein-tyrosine phosphatase family for rational inhibitor design. J Med Chem 52:6649-59 (2009)  
Target
Name:
Receptor-type tyrosine-protein phosphatase beta
Synonyms:
PTPB PTPRB_HUMAN R-PTP-beta Receptor-type tyrosine-protein phosphatase beta (PTPβ) Vascular endothelial protein tyrosine phosphatase
Type:
Protein
Mol. Mass.:
224324.80
Organism:
Homo sapiens (Human)
Description:
P23467
Residue:
1997
  
Inhibitor
Name:
BDBM50118744
Synonyms:
2-(Oxalyl-amino)-4,7-dihydro-5H-thieno[2,3-c]pyran-3-carboxylic acid CHEMBL138806
Type:
Small organic molecule
Emp. Form.:
C10H9NO6S
Mol. Mass.:
271.247
SMILES:
OC(=O)C(=O)Nc1sc2COCCc2c1C(O)=O
: