Target
Cholinesterase
Ligand
BDBM50231951
Substrate
Meas. Tech.
ChEMBL_590773 (CHEMBL1037611)
IC50
1440±n/a nM
Citation
 Bolognesi, MLCavalli, ABergamini, CFato, RLenaz, GRosini, MBartolini, MAndrisano, VMelchiorre, C Toward a rational design of multitarget-directed antioxidants: merging memoquin and lipoic acid molecular frameworks. J Med Chem 52:7883-6 (2009)  
Target
Name:
Cholinesterase
Synonyms:
Acylcholine acylhydrolase Butyrylcholine esterase (BChE) Butyrylcholinesterase (BuChE) CHLE_HUMAN Cholinesterases Pseudocholinesterase
Type:
Homotetramer
Mol. Mass.:
68422.27
Organism:
Homo sapiens (Human)
Description:
P06276
Residue:
602
  
Inhibitor
Name:
BDBM50231951
Synonyms:
2,5-bis(6-((2-methoxybenzyl)(ethyl)amino)hexylamino)cyclohexa-2,5-diene-1,4-dione CHEMBL231160 | memoquin
Type:
Small organic molecule
Emp. Form.:
C38H56N4O4
Mol. Mass.:
632.8756
SMILES:
CCN(CCCCCCNc1cc(O)c(cc1O)N=CCCCCCN(CC)Cc1ccccc1OC)Cc1ccccc1OC
: