Target
Acetylcholinesterase
Ligand
BDBM50231951
Substrate
Meas. Tech.
ChEMBL_590772 (CHEMBL1037610)
IC50
1.5±n/a nM
Citation
 Bolognesi, MLCavalli, ABergamini, CFato, RLenaz, GRosini, MBartolini, MAndrisano, VMelchiorre, C Toward a rational design of multitarget-directed antioxidants: merging memoquin and lipoic acid molecular frameworks. J Med Chem 52:7883-6 (2009)  
Target
Name:
Acetylcholinesterase
Synonyms:
ACES_HUMAN Acetylcholinesterase (AChE) | Acetylcholinesterase (human AChE)
Type:
Enzyme
Mol. Mass.:
67792.70
Organism:
Homo sapiens (Human)
Description:
P22303
Residue:
614
  
Inhibitor
Name:
BDBM50231951
Synonyms:
2,5-bis(6-((2-methoxybenzyl)(ethyl)amino)hexylamino)cyclohexa-2,5-diene-1,4-dione CHEMBL231160 | memoquin
Type:
Small organic molecule
Emp. Form.:
C38H56N4O4
Mol. Mass.:
632.8756
SMILES:
CCN(CCCCCCNc1cc(O)c(cc1O)N=CCCCCCN(CC)Cc1ccccc1OC)Cc1ccccc1OC
: