Target
Acetylcholinesterase
Ligand
BDBM50299466
Substrate
Meas. Tech.
ChEMBL_590772 (CHEMBL1037610)
IC50
190±n/a nM
Citation
 Bolognesi, MLCavalli, ABergamini, CFato, RLenaz, GRosini, MBartolini, MAndrisano, VMelchiorre, C Toward a rational design of multitarget-directed antioxidants: merging memoquin and lipoic acid molecular frameworks. J Med Chem 52:7883-6 (2009)  
Target
Name:
Acetylcholinesterase
Synonyms:
ACES_HUMAN Acetylcholinesterase (AChE) | Acetylcholinesterase (human AChE)
Type:
Enzyme
Mol. Mass.:
67792.70
Organism:
Homo sapiens (Human)
Description:
P22303
Residue:
614
  
Inhibitor
Name:
BDBM50299466
Synonyms:
5-[1,2]Dithiolan-3-yl-pentanoic acid [3-(4-{3-[ethyl-(2-methoxy-benzyl)-amino]-propylamino}-3,6-dioxo-cyclohexa-1,4-dienylamino)-propyl]-amide | CHEMBL574847
Type:
Small organic molecule
Emp. Form.:
C30H44N4O4S2
Mol. Mass.:
588.825
SMILES:
CCN(CCC=Nc1cc(O)c(NCCCNC(=O)CCCCC2CCSS2)cc1O)Cc1ccccc1OC
: