Target
Cholinesterase
Ligand
BDBM50299465
Substrate
Meas. Tech.
ChEMBL_590773 (CHEMBL1037611)
IC50
11100±n/a nM
Citation
 Bolognesi, MLCavalli, ABergamini, CFato, RLenaz, GRosini, MBartolini, MAndrisano, VMelchiorre, C Toward a rational design of multitarget-directed antioxidants: merging memoquin and lipoic acid molecular frameworks. J Med Chem 52:7883-6 (2009)  
Target
Name:
Cholinesterase
Synonyms:
Acylcholine acylhydrolase Butyrylcholine esterase (BChE) Butyrylcholinesterase (BuChE) CHLE_HUMAN Cholinesterases Pseudocholinesterase
Type:
Homotetramer
Mol. Mass.:
68422.27
Organism:
Homo sapiens (Human)
Description:
P06276
Residue:
602
  
Inhibitor
Name:
BDBM50299465
Synonyms:
5-[1,2]Dithiolan-3-yl-pentanoic acid [6-(4-{3-[ethyl-(2-methoxy-benzyl)-amino]-propylamino}-3,6-dioxo-cyclohexa-1,4-dienylamino)-hexyl]-amide | CHEMBL572453
Type:
Small organic molecule
Emp. Form.:
C33H50N4O4S2
Mol. Mass.:
630.905
SMILES:
CCN(CCC=Nc1cc(O)c(NCCCCCCNC(=O)CCCCC2CCSS2)cc1O)Cc1ccccc1OC
: