Target
Elongation of very long chain fatty acids protein 6
Ligand
BDBM50299959
Substrate
Meas. Tech.
ChEMBL_592844 (CHEMBL1045787)
IC50
95±n/a nM
Citation
 Mizutani, TIshikawa, SNagase, TTakahashi, HFujimura, TSasaki, TNagumo, AShimamura, KMiyamoto, YKitazawa, HKanesaka, MYoshimoto, RAragane, KTokita, SSato, N Discovery of novel benzoxazinones as potent and orally active long chain fatty acid elongase 6 inhibitors. J Med Chem 52:7289-300 (2009)  
Target
Name:
Elongation of very long chain fatty acids protein 6
Synonyms:
ELOV6_HUMAN FACE | LCE
Type:
PROTEIN
Mol. Mass.:
31392.28
Organism:
Homo sapiens (Human)
Description:
ChEMBL_572238
Residue:
265
  
Inhibitor
Name:
BDBM50299959
Synonyms:
4-Fluoro-N-{[2-oxo-4-(trifluoromethyl)-1,4-dihydro-2H-3,1-benzoxazin-4-yl]methyl}benzamide | CHEMBL566967
Type:
Small organic molecule
Emp. Form.:
C17H12F4N2O3
Mol. Mass.:
368.2824
SMILES:
Fc1ccc(cc1)C(=O)NCC1(OC(=O)Nc2ccccc12)C(F)(F)F
: