Target
Elongation of very long chain fatty acids protein 5
Ligand
BDBM50299971
Substrate
Meas. Tech.
ChEMBL_592861 (CHEMBL1045804)
IC50
>1E4±n/a nM
Citation
 Mizutani, TIshikawa, SNagase, TTakahashi, HFujimura, TSasaki, TNagumo, AShimamura, KMiyamoto, YKitazawa, HKanesaka, MYoshimoto, RAragane, KTokita, SSato, N Discovery of novel benzoxazinones as potent and orally active long chain fatty acid elongase 6 inhibitors. J Med Chem 52:7289-300 (2009)  
Target
Name:
Elongation of very long chain fatty acids protein 5
Synonyms:
ELOV5_HUMAN ELOVL5
Type:
PROTEIN
Mol. Mass.:
35313.13
Organism:
Homo sapiens (Human)
Description:
ChEMBL_572243
Residue:
299
  
Inhibitor
Name:
BDBM50299971
Synonyms:
4-Fluoro-N-{[(+)-(4S)-2-oxo-6-(1H-pyrazol-5-yl)-4-(trifluoromethyl)-1,4-dihydro-2H-3,1-benzoxazin-4-yl]methyl}benzamide | CHEMBL570571
Type:
Small organic molecule
Emp. Form.:
C20H14F4N4O3
Mol. Mass.:
434.3438
SMILES:
Fc1ccc(cc1)C(=O)NC[C@]1(OC(=O)Nc2ccc(cc12)-c1cc[nH]n1)C(F)(F)F
: