Target
Cyclin-dependent kinase 2
Ligand
BDBM6383
Substrate
Meas. Tech.
ChEMBL_594174 (CHEMBL1039604)
IC50
>360±n/a nM
Citation
 Koehler, LGraf, FBergmann, RSteinbach, JPietzsch, JWuest, F Radiosynthesis and radiopharmacological evaluation of cyclin-dependent kinase 4 (Cdk4) inhibitors. Eur J Med Chem 45:727-37 (2010)  
Target
Name:
Cyclin-dependent kinase 2
Synonyms:
CDK2 CDK2_HUMAN Cell division protein kinase 2 Protein cereblon/Cyclin-dependent kinase 2 | p33 protein kinase
Type:
Enzyme Subunit
Mol. Mass.:
33938.17
Organism:
Homo sapiens (Human)
Description:
P24941
Residue:
298
  
Inhibitor
Name:
BDBM6383
Synonyms:
8-Cyclopentyl-6-iodo-5-methyl-2-(4-piperazin-1-yl-phenylamino)-8H-pyrido[2,3-d]pyrimidin-7-one pyrido[2,3-d]pyrimidin-7-one 30
Type:
Small organic molecule
Emp. Form.:
C23H27IN6O
Mol. Mass.:
530.4046
SMILES:
Cc1c(I)c(=O)n(C2CCCC2)c2nc(Nc3ccc(cc3)N3CCNCC3)ncc12
: