Target
Tyrosine-protein kinase ZAP-70
Ligand
BDBM4887
Substrate
Meas. Tech.
ChEMBL_591751 (CHEMBL1037893)
IC50
25000±n/a nM
Citation
 Sanam, RVadivelan, STajne, SNarasu, LRambabu, GJagarlapudi, SA Discovery of potential ZAP-70 kinase inhibitors: pharmacophore design, database screening and docking studies. Eur J Med Chem 44:4793-800 (2009)  
Target
Name:
Tyrosine-protein kinase ZAP-70
Synonyms:
70 kDa zeta-associated protein Syk-related tyrosine kinase Tyrosine-protein kinase ZAP-70 Tyrosine-protein kinase ZAP-70 (ZAP70) ZAP70 Zeta-chain (TCR) associated protein kinase 70kDa
Type:
Enzyme
Mol. Mass.:
69881.61
Organism:
Homo sapiens (Human)
Description:
ZAP-70 SH2 domain was expressed and purified from E. coli using O-phospho-L-tyrosine-agarose column.
Residue:
619
  
Inhibitor
Name:
BDBM4887
Synonyms:
3-(4-methyl-5-{[(3Z)-2-oxo-2,3-dihydro-1H-indol-3-ylidene]methyl}-1H-pyrrol-3-yl)propanoic acid 3-substituted indolin-2-one 11a | SU5402 analog 11a
Type:
Small organic molecule
Emp. Form.:
C17H16N2O3
Mol. Mass.:
296.3205
SMILES:
Cc1c(CCC(O)=O)c[nH]c1\C=C1/C(=O)Nc2ccccc12
: