Target
Adenosine receptor A3
Ligand
BDBM50300875
Substrate
Meas. Tech.
ChEMBL_599661 (CHEMBL1042905)
Ki
10400±n/a nM
Citation
 El-Tayeb, AIqbal, JBehrenswerth, ARomio, MSchneider, MZimmermann, HSchrader, JMüller, CE Nucleoside-5'-monophosphates as prodrugs of adenosine A2A receptor agonists activated by ecto-5'-nucleotidase. J Med Chem 52:7669-77 (2009)  
Target
Name:
Adenosine receptor A3
Synonyms:
A3 adenosine receptor (hA3) ADORA3 | Adenosine A3 receptor (A3AR)
Type:
G Protein-Coupled Receptor (GPCR)
Mol. Mass.:
36197.32
Organism:
Homo sapiens (Human)
Description:
P0DMS8
Residue:
318
  
Inhibitor
Name:
BDBM50300875
Synonyms:
(2R,3R,4S,5R)-2-(6-amino-2-(cyclopentylthio)-9H-purin-9-yl)-5-(hydroxymethyl)tetrahydrofuran-3,4-diol | CHEMBL576883
Type:
Small organic molecule
Emp. Form.:
C15H21N5O4S
Mol. Mass.:
367.423
SMILES:
Nc1nc(SC2CCCC2)nc2n(cnc12)[C@@H]1O[C@H](CO)[C@@H](O)[C@H]1O
: